前提
アプリ製作のために、vscodeでflutterを行おうとセットアップまでは上手くいったのですが、いざAndroidエミュレータでサンプルコードのアプリをデバッグしようとするとエラーが出てしまいます。「Edge」「Chrome」でのデバッグは成功しています。
実現したいこと
Androidエミュレータでサンプルコードのアプリを起動させたい。
発生している問題・エラーメッセージ
FAILURE: Build failed with an exception. * Where: Script 'C:\Users\inubo\Downloads\flutter_windows_3.3.7-stable\flutter\packages\flutter_tools\gradle\flutter.gradle' line: 1159 * What went wrong: Execution failed for task ':app:compileFlutterBuildDebug'. > Process 'command 'C:\Users\inubo\Downloads\flutter_windows_3.3.7-stable\flutter\bin\flutter.bat'' finished with non-zero exit value 1 * Try: > Run with --stacktrace option to get the stack trace. > Run with --info or --debug option to get more log output. > Run with --scan to get full insights. * Get more help at https://help.gradle.org BUILD FAILED in 7s Exception: Gradle task assembleDebug failed with exit code 1
該当のソースコード
試したこと
Flutter clean
Flutter pub get
補足情報(FW/ツールのバージョンなど)
ツールのバージョン
Flutter 3.3.7
Dart 2.18.4
DevTools 2.15.0
vscode 1.73.0 (user setup)
0 コメント